BDBM50077224 CHEMBL3416880
SMILES Clc1ccc2c(c[nH]c2c1)C(=O)N1CCN(CC1)c1ccccc1Cl
InChI Key InChIKey=ZDUAQXCLICAACJ-UHFFFAOYSA-N
Data  2 KI
  Tab Delimited (TSV)   2D SDfile   Computed 3D by Vconf -m prep SDfile
Find this compound or compounds like it in BindingDB:
Activity Spreadsheet -- Enzyme Inhibition Constant Data from BindingDB
Found 2 hits for monomerid = 50077224
TargetVasopressin V1a receptor(Homo sapiens (Human))
F. Hoffmann-La Roche
Curated by ChEMBL
LigandPNGBDBM50077224(CHEMBL3416880)
Affinity DataKi:  118nM. Assay description: Displacement of [3H]-vasopressin from human vasopressin 1a receptor expressed in HEK293 cell membranes after 1 hr by scintillation proximity assay
In DepthDetails ArticlePubMed
TargetVasopressin V1a receptor(Mus musculus)
F. Hoffmann-La Roche
Curated by ChEMBL
LigandPNGBDBM50077224(CHEMBL3416880)
Affinity DataKi:  1.97E+3nM. Assay description: Displacement of [3H]-vasopressin from mouse vasopressin 1a receptor expressed in HEK293 cell membranes after 1 hr by scintillation proximity assay
In DepthDetails ArticlePubMed