BDBM50077263 (-)-Phenethylcymserine::(4-Isopropyl-phenyl)-carbamic acid (S)-3a,8-dimethyl-1-phenethyl-1,2,3,3a,8,8a-hexahydro-pyrrolo[2,3-b]indol-5-yl ester::CHEMBL54577
SMILES CC(C)c1ccc(NC(=O)Oc2ccc3N(C)C4N(CCc5ccccc5)CC[C@@]4(C)c3c2)cc1
InChI Key InChIKey=WKDFOVDLOVYRAJ-TXDWVUBVSA-N
Data  4 IC50
  Tab Delimited (TSV)   2D SDfile   Computed 3D by Vconf -m prep SDfile
Find this compound or compounds like it in BindingDB:
Activity Spreadsheet -- Enzyme Inhibition Constant Data from BindingDB
Found 4 hits for monomerid = 50077263
TargetAcetylcholinesterase(Homo sapiens (Human))
National Institute On Aging Intramural Research Program
Curated by ChEMBL
LigandPNGBDBM50077263((-)-Phenethylcymserine | (4-Isopropyl-phenyl)-carb...)
Affinity DataIC50: >3.00E+4nM. Assay description: Ability to inhibit acetylcholinesterase (AChE), freshly prepared from human erythrocytes
In DepthDetails ArticlePubMed
TargetCholinesterase(Homo sapiens (Human))
National Institute On Aging
Curated by ChEMBL
LigandPNGBDBM50077263((-)-Phenethylcymserine | (4-Isopropyl-phenyl)-carb...)
Affinity DataIC50:  6nM. Assay description: Inhibition of human plasma BChE pretreated for 30 mins by Ellman technique
In DepthDetails ArticlePubMed
TargetAcetylcholinesterase(Homo sapiens (Human))
National Institute On Aging Intramural Research Program
Curated by ChEMBL
LigandPNGBDBM50077263((-)-Phenethylcymserine | (4-Isopropyl-phenyl)-carb...)
Affinity DataIC50: >3.00E+4nM. Assay description: Inhibition of human whole RBC AChE pretreated for 30 mins by Ellman technique
In DepthDetails ArticlePubMed
TargetCholinesterase(Homo sapiens (Human))
National Institute On Aging
Curated by ChEMBL
LigandPNGBDBM50077263((-)-Phenethylcymserine | (4-Isopropyl-phenyl)-carb...)
Affinity DataIC50:  6nM. Assay description: Ability to inhibit butyrylcholinesterase (BChE), freshly prepared from human plasma
In DepthDetails ArticlePubMed