BDBM50077286 CHEMBL437057::H-Pfp-cyclo[DCys-2Pal-DTrp-Lys-Val-Cys]-Pfp-NH2
SMILES CC(C)[C@H]1NC(=O)[C@H](CCCCN)NC(=O)[C@@H](Cc2c[nH]c3ccccc23)NC(=O)[C@H](Cc2ccccn2)NC(=O)[C@H](CSSC[C@@H](NC1=O)C(=O)N[C@@H](Cc1c(F)c(F)c(F)c(F)c1F)C(N)=O)NC(=O)[C@@H](N)Cc1c(F)c(F)c(F)c(F)c1F
InChI Key InChIKey=DIMKSSHEKLGOMG-ZQSYDISGSA-N
Data  4 KI
  Tab Delimited (TSV)   2D SDfile   Computed 3D by Vconf -m prep SDfile
Find this compound or compounds like it in BindingDB:
Activity Spreadsheet -- Enzyme Inhibition Constant Data from BindingDB
Found 4 hits for monomerid = 50077286
TargetSomatostatin receptor type 3(Homo sapiens (Human))
Tulane University School Of Medicine
Curated by ChEMBL
LigandPNGBDBM50077286(CHEMBL437057 | H-Pfp-cyclo[DCys-2Pal-DTrp-Lys-Val-...)
Affinity DataKi:  170nM. Assay description: The compound was tested for binding affinity against human Somatostatin receptor type 3
In DepthDetails ArticlePubMed
TargetSomatostatin receptor type 1(Homo sapiens (Human))
Tulane University School Of Medicine
Curated by ChEMBL
LigandPNGBDBM50077286(CHEMBL437057 | H-Pfp-cyclo[DCys-2Pal-DTrp-Lys-Val-...)
Affinity DataKi:  568nM. Assay description: The compound was tested for binding affinity against human Somatostatin receptor type 1
In DepthDetails ArticlePubMed
TargetSomatostatin receptor type 5(Homo sapiens (Human))
Tulane University School Of Medicine
Curated by ChEMBL
LigandPNGBDBM50077286(CHEMBL437057 | H-Pfp-cyclo[DCys-2Pal-DTrp-Lys-Val-...)
Affinity DataKi:  918nM. Assay description: The compound was tested for binding affinity against human Somatostatin receptor type 5
In DepthDetails ArticlePubMed
TargetSomatostatin receptor type 2(Homo sapiens (Human))
Tulane University School Of Medicine
Curated by ChEMBL
LigandPNGBDBM50077286(CHEMBL437057 | H-Pfp-cyclo[DCys-2Pal-DTrp-Lys-Val-...)
Affinity DataKi: >1.00E+3nM. Assay description: The compound was tested for binding affinity against human Somatostatin receptor type 2
In DepthDetails ArticlePubMed