BDBM50077290 CHEMBL437220::H-Cpa-cyclo[DCys-Pal-DTrp-Lys-Val-Cys]-Nal-NH2
SMILES CC(C)[C@H]1NC(=O)[C@H](CCCCN)NC(=O)[C@@H](Cc2c[nH]c3ccccc23)NC(=O)[C@H](Cc2cccnc2)NC(=O)[C@H](CSSC[C@@H](NC1=O)C(=O)N[C@@H](Cc1ccc2ccccc2c1)C(N)=O)NC(=O)[C@@H](N)Cc1ccc(Cl)cc1
InChI Key InChIKey=LISLABYFWXYBID-TVEITAAYSA-N
Data  5 KI
  Tab Delimited (TSV)   2D SDfile   Computed 3D by Vconf -m prep SDfile
Find this compound or compounds like it in BindingDB:
Activity Spreadsheet -- Enzyme Inhibition Constant Data from BindingDB
Found 5 hits for monomerid = 50077290
TargetSomatostatin receptor type 2(Homo sapiens (Human))
Tulane University School Of Medicine
Curated by ChEMBL
LigandPNGBDBM50077290(CHEMBL437220 | H-Cpa-cyclo[DCys-Pal-DTrp-Lys-Val-C...)
Affinity DataKi:  25nM. Assay description: The compound was tested for binding affinity against human Somatostatin receptor type 2
In DepthDetails ArticlePubMed
TargetSomatostatin receptor type 3(Homo sapiens (Human))
Tulane University School Of Medicine
Curated by ChEMBL
LigandPNGBDBM50077290(CHEMBL437220 | H-Cpa-cyclo[DCys-Pal-DTrp-Lys-Val-C...)
Affinity DataKi:  85nM. Assay description: The compound was tested for binding affinity against human Somatostatin receptor type 3
In DepthDetails ArticlePubMed
TargetSomatostatin receptor type 5(Homo sapiens (Human))
Tulane University School Of Medicine
Curated by ChEMBL
LigandPNGBDBM50077290(CHEMBL437220 | H-Cpa-cyclo[DCys-Pal-DTrp-Lys-Val-C...)
Affinity DataKi:  240nM. Assay description: The compound was tested for binding affinity against human Somatostatin receptor type 5
In DepthDetails ArticlePubMed
TargetSomatostatin receptor type 1(Homo sapiens (Human))
Tulane University School Of Medicine
Curated by ChEMBL
LigandPNGBDBM50077290(CHEMBL437220 | H-Cpa-cyclo[DCys-Pal-DTrp-Lys-Val-C...)
Affinity DataKi: >1.00E+3nM. Assay description: The compound was tested for binding affinity against human Somatostatin receptor type 1
In DepthDetails ArticlePubMed
TargetSomatostatin receptor type 4(Homo sapiens (Human))
Tulane University School Of Medicine
Curated by ChEMBL
LigandPNGBDBM50077290(CHEMBL437220 | H-Cpa-cyclo[DCys-Pal-DTrp-Lys-Val-C...)
Affinity DataKi:  1.59E+3nM. Assay description: The compound was tested for binding affinity against human Somatostatin receptor type 4
In DepthDetails ArticlePubMed