BDBM50077440 CHEMBL56137::{(S)-1-[(S)-3-Hydroxycarbamoyl-2-(4-methoxy-benzenesulfonyl)-1,2,3,4-tetrahydro-isoquinolin-7-ylcarbamoyl]-ethyl}-carbamic acid tert-butyl ester
SMILES COc1ccc(cc1)S(=O)(=O)N1Cc2cc(NC(=O)[C@H](C)NC(=O)OC(C)(C)C)ccc2C[C@H]1C(=O)NO
InChI Key InChIKey=PNICWAPKRSLYIU-BTYIYWSLSA-N
Data  1 IC50
  Tab Delimited (TSV)   2D SDfile   Computed 3D by Vconf -m prep SDfile
Find this compound or compounds like it in BindingDB:
Activity Spreadsheet -- Enzyme Inhibition Constant Data from BindingDB
Found 1 hit for monomerid = 50077440
TargetNeutrophil collagenase(Homo sapiens (Human))
Hoechst Marion Roussel
Curated by ChEMBL
LigandPNGBDBM50077440(CHEMBL56137 | {(S)-1-[(S)-3-Hydroxycarbamoyl-2-(4-...)
Affinity DataIC50:  2nM. Assay description: Inhibition of human neutrophil collagenase [Matrix Metalloprotease-8, MMP-8]
In DepthDetails ArticlePubMed