BDBM50077505 (S)-2-Amino-N-[(5S,12R,15S,18R,20aS)-18-cyclohexylmethyl-12-(2-guanidino-ethyl)-15-(1H-indol-3-ylmethyl)-4,11,14,17,20-pentaoxo-icosahydro-3a,10,13,16,19-pentaaza-cyclopentacyclononadecen-5-yl]-3-phenyl-propionamide::CHEMBL435777
SMILES N[C@@H](Cc1ccccc1)C(=O)N[C@H]1CCCCNC(=O)[C@@H](CCNC(N)=N)NC(=O)[C@H](Cc2c[nH]c3ccccc23)NC(=O)[C@@H](CC2CCCCC2)NC(=O)[C@@H]2CCCN2C1=O
InChI Key InChIKey=AGJLQWICTGRNHX-AEYODTTDSA-N
Data  2 IC50
  Tab Delimited (TSV)   2D SDfile   Computed 3D by Vconf -m prep SDfile
Find this compound or compounds like it in BindingDB:
Activity Spreadsheet -- Enzyme Inhibition Constant Data from BindingDB
Found 2 hits for monomerid = 50077505
TargetC5a anaphylatoxin chemotactic receptor 1(Homo sapiens (Human))
University Of Queensland
Curated by ChEMBL
LigandPNGBDBM50077505((S)-2-Amino-N-[(5S,12R,15S,18R,20aS)-18-cyclohexyl...)
Affinity DataIC50:  8.13E+3nM. Assay description: Inhibition of binding of [125I]C5a to human polymorphonuclear leukocyte C5a receptor
In DepthDetails ArticlePubMed
TargetC5a anaphylatoxin chemotactic receptor 1(Homo sapiens (Human))
University Of Queensland
Curated by ChEMBL
LigandPNGBDBM50077505((S)-2-Amino-N-[(5S,12R,15S,18R,20aS)-18-cyclohexyl...)
Affinity DataIC50:  8.10E+3nM. Assay description: Inhibition of binding of [125I]-C5a to human polymorphonuclear leukocyte C5a receptor
In DepthDetails ArticlePubMed