BDBM50077539 ((S)-7-Nitro-1,2,3,4-tetrahydro-isoquinolin-3-yl)-methanol::CHEMBL62034
SMILES OC[C@@H]1Cc2ccc(cc2CN1)[N+]([O-])=O
InChI Key InChIKey=RNUCRXHRBPLYTA-VIFPVBQESA-N
Data  4 KI
  Tab Delimited (TSV)   2D SDfile   Computed 3D by Vconf -m prep SDfile
Find this compound or compounds like it in BindingDB:
Activity Spreadsheet -- Enzyme Inhibition Constant Data from BindingDB
Found 4 hits for monomerid = 50077539
TargetPhenylethanolamine N-methyltransferase(Bos taurus (bovine))
University Of Kansas
Curated by ChEMBL
LigandPNGBDBM50077539(((S)-7-Nitro-1,2,3,4-tetrahydro-isoquinolin-3-yl)-...)
Affinity DataKi:  900nM. Assay description: Inhibition of bovine adrenal Phenylethanolamine N-Methyltransferase
In DepthDetails ArticlePubMed
TargetPhenylethanolamine N-methyltransferase(Bos taurus (bovine))
University Of Kansas
Curated by ChEMBL
LigandPNGBDBM50077539(((S)-7-Nitro-1,2,3,4-tetrahydro-isoquinolin-3-yl)-...)
Affinity DataKi:  900nM. Assay description: In vitro inhibition of PNMT (Phenylethanolamine N-Methyltransferase).
In DepthDetails ArticlePubMed
TargetPhenylethanolamine N-methyltransferase(Bos taurus (bovine))
University Of Kansas
Curated by ChEMBL
LigandPNGBDBM50077539(((S)-7-Nitro-1,2,3,4-tetrahydro-isoquinolin-3-yl)-...)
Affinity DataKi:  2.36E+3nM. Assay description: Inhibitory activity against bovine adrenal phenylethanolamine N-methyl-transferase (PNMT)
In DepthDetails ArticlePubMed
LigandPNGBDBM50077539(((S)-7-Nitro-1,2,3,4-tetrahydro-isoquinolin-3-yl)-...)
Affinity DataKi:  7.67E+3nM. Assay description: Inhibition of [3H]clonidine binding to the rat alpha-2-adrenoceptor
In DepthDetails ArticlePubMed