BDBM50077720 5-Amino-1H-[1,2,4]triazole-3-carboxylic acid ((S)-1-{(S)-1-[((S)-carbamoyl-phenyl-methyl)-carbamoyl]-4-guanidino-butylcarbamoyl}-2-cyclohexyl-ethyl)-amide::CHEMBL33940
SMILES NC(=N)NCCC[C@H](NC(=O)[C@H](CC1CCCCC1)NC(=O)c1nnc(N)[nH]1)C(=O)N[C@H](C(N)=O)c1ccccc1
InChI Key InChIKey=BINWWXFRVLPIPV-FHWLQOOXSA-N
Data  1 IC50  1 EC50
  Tab Delimited (TSV)   2D SDfile   Computed 3D by Vconf -m prep SDfile
Find this compound or compounds like it in BindingDB:
Activity Spreadsheet -- Enzyme Inhibition Constant Data from BindingDB
Found 2 hits for monomerid = 50077720
TargetProteinase-activated receptor 1(Homo sapiens (Human))
The R. W. Johnson Pharmaceutical Research Institute
Curated by ChEMBL
LigandPNGBDBM50077720(5-Amino-1H-[1,2,4]triazole-3-carboxylic acid ((S)-...)
Affinity DataEC50:  3.10E+3nM. Assay description: Inhibition of [3H]-S-(p-F-Phe)-Har-L-Har-KY-NH2 binding to thrombin receptor (PAR-1) on membranes from CHRF cells
In DepthDetails ArticlePubMed
TargetProteinase-activated receptor 1(Homo sapiens (Human))
The R. W. Johnson Pharmaceutical Research Institute
Curated by ChEMBL
LigandPNGBDBM50077720(5-Amino-1H-[1,2,4]triazole-3-carboxylic acid ((S)-...)
Affinity DataIC50:  7.00E+3nM. Assay description: Inhibition of [3H]-S-(p-F-Phe)-Har-L-Har-KY-NH2 binding to thrombin receptor (PAR-1) on membranes from CHRF cells
In DepthDetails ArticlePubMed