BDBM50077752 5-((E)-2-Methyl-3-phenyl-acryloylamino)-1H-[1,2,4]triazole-3-carboxylic acid {(S)-1-[(S)-1-((S)-1-carbamoyl-2-phenyl-ethylcarbamoyl)-4-guanidino-butylcarbamoyl]-2-cyclohexyl-ethyl}-amide::CHEMBL33873
SMILES CC(=Cc1ccccc1)C(=O)Nc1nnc([nH]1)C(=O)N[C@@H](CC1CCCCC1)C(=O)N[C@@H](CCCNC(N)=N)C(=O)N[C@@H](Cc1ccccc1)C(N)=O
InChI Key InChIKey=NVAIYMVSMZKECH-AWCRTANDSA-N
Data  1 IC50  1 EC50
  Tab Delimited (TSV)   2D SDfile   Computed 3D by Vconf -m prep SDfile
Find this compound or compounds like it in BindingDB:
Activity Spreadsheet -- Enzyme Inhibition Constant Data from BindingDB
Found 2 hits for monomerid = 50077752
TargetProteinase-activated receptor 1(Homo sapiens (Human))
The R. W. Johnson Pharmaceutical Research Institute
Curated by ChEMBL
LigandPNGBDBM50077752(5-((E)-2-Methyl-3-phenyl-acryloylamino)-1H-[1,2,4]...)
Affinity DataIC50:  4.20E+3nM. Assay description: Inhibition of [3H]-S-(p-F-Phe)-Har-L-Har-KY-NH2 binding to Thrombin receptor 1 (PAR-1) on membranes from CHRF cells
In DepthDetails ArticlePubMed
TargetProteinase-activated receptor 1(Homo sapiens (Human))
The R. W. Johnson Pharmaceutical Research Institute
Curated by ChEMBL
LigandPNGBDBM50077752(5-((E)-2-Methyl-3-phenyl-acryloylamino)-1H-[1,2,4]...)
Affinity DataEC50:  760nM. Assay description: Activation of human platelet aggregation (gel-filtered platelets) induced by alpha thrombin
In DepthDetails ArticlePubMed