BDBM50077795 2-{4-[(2,4-Diamino-pteridin-6-ylmethyl)-(5-ethoxycarbonyl-pentyl)-amino]-benzoylamino}-pentanedioic acid diethyl ester::CHEMBL265757
SMILES CCOC(=O)CCCCCN(Cc1cnc2nc(N)nc(N)c2n1)c1ccc(cc1)C(=O)NC(CCC(=O)OCC)C(=O)OCC
InChI Key InChIKey=HPAONGVVQJFOPD-UHFFFAOYSA-N
Data  2 KI
  Tab Delimited (TSV)   2D SDfile   Computed 3D by Vconf -m prep SDfile
Find this compound or compounds like it in BindingDB:
Activity Spreadsheet -- Enzyme Inhibition Constant Data from BindingDB
Found 2 hits for monomerid = 50077795
TargetDihydrofolate reductase(Homo sapiens (Human))
Cardiff University
Curated by ChEMBL
LigandPNGBDBM50077795(2-{4-[(2,4-Diamino-pteridin-6-ylmethyl)-(5-ethoxyc...)
Affinity DataKi:  56nM. Assay description: Inhibitory activity against Trypanosoma cruzi dihydrofolate reductase
In DepthDetails ArticlePubMed
TargetDihydrofolate reductase(Homo sapiens (Human))
Cardiff University
Curated by ChEMBL
LigandPNGBDBM50077795(2-{4-[(2,4-Diamino-pteridin-6-ylmethyl)-(5-ethoxyc...)
Affinity DataKi:  485nM. Assay description: Inhibitory activity against dihydrofolate reductase in humans
In DepthDetails ArticlePubMed