BDBM50077912 CHEMBL3417231
SMILES CC(C)[C@@]1(CC[C@H](C1)NC1CC(C)c2cc(Br)ccc12)C(=O)N1CCc2ccc(cc2C1)C(F)(F)F
InChI Key InChIKey=XVLPHLABYJZKGZ-CXROUHMISA-N
Data  1 KI
  Tab Delimited (TSV)   2D SDfile   Computed 3D by Vconf -m prep SDfile
Find this compound or compounds like it in BindingDB:
Activity Spreadsheet -- Enzyme Inhibition Constant Data from BindingDB
Found 1 hit for monomerid = 50077912
TargetC-C chemokine receptor type 2(Homo sapiens (Human))
Leiden University
Curated by ChEMBL
LigandPNGBDBM50077912(CHEMBL3417231)
Affinity DataKi:  2nM. Assay description: Displacement of 0.1 nM [125I]CCL2 from human CCR2 expressing human U2OS cell membrane by scintillation spectrometry
In DepthDetails ArticlePubMed