BDBM50078238 2-(2,6-Dichloro-phenyl)-5-(2-methoxy-phenyl)-7-methyl-5H-thiazolo[3,2-a]pyrimidine-6-carboxylic acid ethyl ester::CHEMBL439925
SMILES CCOC(=O)C1=C(C)N=C2SC(=CN2C1c1ccccc1OC)c1c(Cl)cccc1Cl
InChI Key InChIKey=FBASMBMCSXJNML-UHFFFAOYSA-N
Data  1 KI
  Tab Delimited (TSV)   2D SDfile   Computed 3D by Vconf -m prep SDfile
Find this compound or compounds like it in BindingDB:
Activity Spreadsheet -- Enzyme Inhibition Constant Data from BindingDB
Found 1 hit for monomerid = 50078238
TargetMetabotropic glutamate receptor 2(Rattus norvegicus)
F. Hoffmann-La Roche
Curated by ChEMBL
LigandPNGBDBM50078238(2-(2,6-Dichloro-phenyl)-5-(2-methoxy-phenyl)-7-met...)
Affinity DataKi:  4.00E+3nM. Assay description: Inhibition of 1S,3R-ACPD (10 microM) -stimulated GTP gamma 35S binding on rat Metabotropic glutamate receptor 2 transfected in CHO cells
In DepthDetails ArticlePubMed