BDBM50078343 6-(4-Hexyl-phenylamino)-1-(3-methoxy-propyl)-1H-pyrimidine-2,4-dione::CHEMBL80215
SMILES CCCCCCc1ccc(Nc2cc(=O)[nH]c(=O)n2CCCOC)cc1
InChI Key InChIKey=SDQRCNDEZMTBNN-UHFFFAOYSA-N
Data  1 IC50
  Tab Delimited (TSV)   2D SDfile   Computed 3D by Vconf -m prep SDfile
Find this compound or compounds like it in BindingDB:
Activity Spreadsheet -- Enzyme Inhibition Constant Data from BindingDB
Found 1 hit for monomerid = 50078343
TargetUracil-DNA glycosylase(Homo sapiens (Human))
University Of Massachusetts Medical Center
Curated by ChEMBL
LigandPNGBDBM50078343(6-(4-Hexyl-phenylamino)-1-(3-methoxy-propyl)-1H-py...)
Affinity DataIC50: >1.00E+5nM. Assay description: Inhibitory potency of the compound against HSV-1 UDG (Herpes Simplex virus type-I Uracil DNA glycosylase)
In DepthDetails ArticlePubMed