BDBM50078453 2-Amino-7-pyridin-4-ylmethyl-3,5-dihydro-pyrrolo[3,2-d]pyrimidin-4-one::2-amino-7-(pyridin-4-ylmethyl)-3H-pyrrolo[3,2-d]pyrimidin-4(5H)-one::CHEMBL79865
SMILES Nc1nc2c(Cc3ccncc3)c[nH]c2c(=O)[nH]1
InChI Key InChIKey=MABQSTXKBLIFAR-UHFFFAOYSA-N
Data  2 KI  2 IC50
  Tab Delimited (TSV)   2D SDfile   Computed 3D by Vconf -m prep SDfile
Find this compound or compounds like it in BindingDB:
Activity Spreadsheet -- Enzyme Inhibition Constant Data from BindingDB
Found 4 hits for monomerid = 50078453
TargetPurine nucleoside phosphorylase(Bos taurus (bovine))
University Of Michigan
Curated by ChEMBL
LigandPNGBDBM50078453(2-Amino-7-pyridin-4-ylmethyl-3,5-dihydro-pyrrolo[3...)
Affinity DataKi:  16.9nM. Assay description: Inhibitory activity against calf spleen purine nucleoside phosphorylase (PNP) using 2-amino-6-mercapto-7-methyl purine ribonucleoside (MESG) as subst...
In DepthDetails ArticlePubMed
TargetPurine nucleoside phosphorylase(Bos taurus (bovine))
University Of Michigan
Curated by ChEMBL
LigandPNGBDBM50078453(2-Amino-7-pyridin-4-ylmethyl-3,5-dihydro-pyrrolo[3...)
Affinity DataKi:  25.4nM. Assay description: Inhibitory activity against calf spleen purine nucleoside phosphorylase (PNP) using inosine as substrate at a concentration of 10 uM.
In DepthDetails ArticlePubMed
TargetPurine nucleoside phosphorylase(Bos taurus (bovine))
University Of Michigan
Curated by ChEMBL
LigandPNGBDBM50078453(2-Amino-7-pyridin-4-ylmethyl-3,5-dihydro-pyrrolo[3...)
Affinity DataIC50:  63.5nM. Assay description: Inhibitory activity against calf spleen purine nucleoside phosphorylase (PNP) using inosine as substrate at a concentration of 10 uM.
In DepthDetails ArticlePubMed
TargetPurine nucleoside phosphorylase(Homo sapiens (Human))
Universidade Federal Da Bahia
Curated by ChEMBL
LigandPNGBDBM50078453(2-Amino-7-pyridin-4-ylmethyl-3,5-dihydro-pyrrolo[3...)
Affinity DataIC50:  100nM. Assay description: Inhibition of human purine nucleoside phosphorylase
In DepthDetails ArticlePubMed