BDBM50078481 4-Benzyl-1-[4-(3-chloro-phenyl)-but-3-ynyl]-piperidine::CHEMBL311884
SMILES Clc1cccc(c1)C#CCCN1CCC(Cc2ccccc2)CC1
InChI Key InChIKey=QZCFWXKDDJAIKH-UHFFFAOYSA-N
Data  3 IC50
  Tab Delimited (TSV)   2D SDfile   Computed 3D by Vconf -m prep SDfile
Find this compound or compounds like it in BindingDB:
Activity Spreadsheet -- Enzyme Inhibition Constant Data from BindingDB
Found 3 hits for monomerid = 50078481
LigandPNGBDBM50078481(4-Benzyl-1-[4-(3-chloro-phenyl)-but-3-ynyl]-piperi...)
Affinity DataIC50: >1.00E+5nM. Assay description: The compound was tested for antagonistic activity against rat NR1A/2C receptor expressed in Xenopus oocytes
In DepthDetails ArticlePubMed
TargetGlutamate receptor ionotropic, NMDA 1/2A(Rattus norvegicus (Rat))
Cocensys
Curated by ChEMBL
LigandPNGBDBM50078481(4-Benzyl-1-[4-(3-chloro-phenyl)-but-3-ynyl]-piperi...)
Affinity DataIC50: >1.00E+5nM. Assay description: Antagonistic activity against rat NR1A/2A receptor, expressed in Xenopus oocytes
In DepthDetails ArticlePubMed
TargetGlutamate receptor ionotropic, NMDA 1/2B(Rattus norvegicus (Rat))
Cocensys
Curated by ChEMBL
LigandPNGBDBM50078481(4-Benzyl-1-[4-(3-chloro-phenyl)-but-3-ynyl]-piperi...)
Affinity DataIC50:  3.80E+3nM. Assay description: Antagonistic activity against rat NR1A/2B receptor expressed in Xenopus oocytes
In DepthDetails ArticlePubMed