BDBM50078668 3-(4-Phenylsulfanyl-benzenesulfonyl)-cyclohexanethiol::CHEMBL300697
SMILES SC1CCCC(C1)S(=O)(=O)c1ccc(Sc2ccccc2)cc1
InChI Key InChIKey=XUDODBAIOYVRJQ-UHFFFAOYSA-N
Data  3 IC50
  Tab Delimited (TSV)   2D SDfile   Computed 3D by Vconf -m prep SDfile
Find this compound or compounds like it in BindingDB:
Activity Spreadsheet -- Enzyme Inhibition Constant Data from BindingDB
Found 3 hits for monomerid = 50078668
TargetNeutrophil collagenase(Homo sapiens (Human))
Searle Discovery Research
Curated by ChEMBL
LigandPNGBDBM50078668(3-(4-Phenylsulfanyl-benzenesulfonyl)-cyclohexaneth...)
Affinity DataIC50:  50nM. Assay description: Inhibition of human recombinant matrix metalloproteinase-8 (hMMP-8)
In DepthDetails ArticlePubMed
TargetInterstitial collagenase(Homo sapiens (Human))
Searle Discovery Research
Curated by ChEMBL
LigandPNGBDBM50078668(3-(4-Phenylsulfanyl-benzenesulfonyl)-cyclohexaneth...)
Affinity DataIC50: >1.00E+4nM. Assay description: Inhibition of human recombinant matrix metalloproteinase-1 (hMMP-1)
In DepthDetails ArticlePubMed
TargetCollagenase 3(Homo sapiens (Human))
Searle Discovery Research
Curated by ChEMBL
LigandPNGBDBM50078668(3-(4-Phenylsulfanyl-benzenesulfonyl)-cyclohexaneth...)
Affinity DataIC50:  0.400nM. Assay description: Inhibition of human recombinant matrix metalloproteinase-13 (hMMP-13)
In DepthDetails ArticlePubMed