BDBM50078715 CHEMBL299402::{3-[(1H-Benzoimidazol-2-ylmethyl)-methyl-carbamoyl]-10,11-dihydro-5H-dibenzo[a,d]cyclohepten-10-yl}-acetic acid
SMILES CN(Cc1nc2ccccc2[nH]1)C(=O)c1ccc2CC(CC(O)=O)c3ccccc3Cc2c1
InChI Key InChIKey=KCPOMQGFJBTQPI-UHFFFAOYSA-N
Data  2 KI  1 IC50
  Tab Delimited (TSV)   2D SDfile   Computed 3D by Vconf -m prep SDfile
Find this compound or compounds like it in BindingDB:
Activity Spreadsheet -- Enzyme Inhibition Constant Data from BindingDB
Found 3 hits for monomerid = 50078715
TargetIntegrin alpha-V/beta-3(Homo sapiens (Human))
Smithkline Beecham Pharmaceuticals
Curated by ChEMBL
LigandPNGBDBM50078715(CHEMBL299402 | {3-[(1H-Benzoimidazol-2-ylmethyl)-m...)
Affinity DataKi:  23nM. Assay description: Inhibition of HEK 293 cell adhesion to vitronectin by alpha V beta 3
In DepthDetails ArticlePubMed
TargetIntegrin alpha-IIb/beta-3(Homo sapiens (Human))
Smithkline Beecham Pharmaceuticals
Curated by ChEMBL
LigandPNGBDBM50078715(CHEMBL299402 | {3-[(1H-Benzoimidazol-2-ylmethyl)-m...)
Affinity DataKi: >5.00E+4nM. Assay description: Binding affinity for non-peptide Vitronectin receptor (alpha V beta 3)
In DepthDetails ArticlePubMed
TargetIntegrin alpha-V/beta-3(Homo sapiens (Human))
Smithkline Beecham Pharmaceuticals
Curated by ChEMBL
LigandPNGBDBM50078715(CHEMBL299402 | {3-[(1H-Benzoimidazol-2-ylmethyl)-m...)
Affinity DataIC50:  1.80E+3nM. Assay description: Binding affinity for non-peptide Vitronectin receptor (alpha V beta 3)
In DepthDetails ArticlePubMed