BDBM50078825 CHEMBL83148::N-Phenyl-benzenesulfonamide::phenyl(phenylsulfonyl)amine
SMILES O=S(=O)(Nc1ccccc1)c1ccccc1
InChI Key InChIKey=XAUGWFWQVYXATQ-UHFFFAOYSA-N
Data  3 Kd
  Tab Delimited (TSV)   2D SDfile   Computed 3D by Vconf -m prep SDfile
Find this compound or compounds like it in BindingDB:
Activity Spreadsheet -- Enzyme Inhibition Constant Data from BindingDB
Found 3 hits for monomerid = 50078825
TargetSerine/threonine-protein kinase mTOR(Homo sapiens (Human))
Abbott Laboratories
Curated by ChEMBL
LigandPNGBDBM50078825(CHEMBL83148 | N-Phenyl-benzenesulfonamide | phenyl...)
Affinity DataKd:  1.00E+6nM. Assay description: Dissociation constant when binding to FK506 binding protein (FKBP).
In DepthDetails ArticlePubMed
TargetKelch-like ECH-associated protein 1(Homo sapiens (Human))
University Of Copenhagen
Curated by ChEMBL
LigandPNGBDBM50078825(CHEMBL83148 | N-Phenyl-benzenesulfonamide | phenyl...)
Affinity DataKd:  6.00E+5nM. Assay description: Binding affinity to human recombinant His-tagged Keap1 Kelch domain (321 to 609 residues) expressed in Escherichia coli BL21 (DE3) by saturation tran...
In DepthDetails ArticlePubMed
TargetKelch-like ECH-associated protein 1(Homo sapiens (Human))
University Of Copenhagen
Curated by ChEMBL
LigandPNGBDBM50078825(CHEMBL83148 | N-Phenyl-benzenesulfonamide | phenyl...)
Affinity DataKd:  1.10E+6nM. Assay description: Binding affinity to human recombinant His-tagged Keap1 Kelch domain (321 to 609 residues) expressed in Escherichia coli BL21 (DE3) assessed as dissoc...
In DepthDetails ArticlePubMed