BDBM50078901 CHEMBL3416635
SMILES Fc1cccc(COc2ccc(Nc3ncnc4sc(cc34)C#CC3CCCN3)cc2Cl)c1
InChI Key InChIKey=TWIUFSQIKGYUBP-UHFFFAOYSA-N
Data  1 IC50
  Tab Delimited (TSV)   2D SDfile   Computed 3D by Vconf -m prep SDfile
Find this compound or compounds like it in BindingDB:
Activity Spreadsheet -- Enzyme Inhibition Constant Data from BindingDB
Found 1 hit for monomerid = 50078901
TargetEpidermal growth factor receptor(Homo sapiens (Human))
Norwegian University Of Science And Technology
Curated by ChEMBL
LigandPNGBDBM50078901(CHEMBL3416635)
Affinity DataIC50:  109nM. Assay description: Inhibition of EGFR (unknown origin) after 40 mins by scintillation proximity assay
In DepthDetails ArticlePubMed