BDBM50079146 3-Dimethylamino-N-[7-(3-dimethylamino-propionylamino)-9-oxo-9H-fluoren-2-yl]-propionamide::CHEMBL89337
SMILES CN(C)CCC(=O)Nc1ccc2-c3ccc(NC(=O)CCN(C)C)cc3C(=O)c2c1
InChI Key InChIKey=XYGVVZGRORVSNV-UHFFFAOYSA-N
Data  2 IC50
  Tab Delimited (TSV)   2D SDfile   Computed 3D by Vconf -m prep SDfile
Find this compound or compounds like it in BindingDB:
Activity Spreadsheet -- Enzyme Inhibition Constant Data from BindingDB
Found 2 hits for monomerid = 50079146
TargetTelomerase reverse transcriptase(Homo sapiens (Human))TBA
LigandPNGBDBM50079146(3-Dimethylamino-N-[7-(3-dimethylamino-propionylami...)
Affinity DataIC50:  1.62E+10nM. Assay description: Inhibition of telomerase (unknown origin)
In DepthDetails Article
TargetTelomerase reverse transcriptase(Homo sapiens (Human))TBA
LigandPNGBDBM50079146(3-Dimethylamino-N-[7-(3-dimethylamino-propionylami...)
Affinity DataIC50:  1.62E+4nM. Assay description: Inhibitory activity against telomerase
In DepthDetails ArticlePubMed