BDBM50079344 CHEMBL3416775
SMILES CCNC(=O)[C@H]1O[C@H]([C@H](O)[C@@H]1O)n1cnc2c(N)nc(NCCN3CCN(CC3)c3ccccc3)nc12
InChI Key InChIKey=KZRRJUCUDUDDFB-QPXQOZNCSA-N
Data  3 KI  2 EC50
  Tab Delimited (TSV)   2D SDfile   Computed 3D by Vconf -m prep SDfile
Find this compound or compounds like it in BindingDB:
Activity Spreadsheet -- Enzyme Inhibition Constant Data from BindingDB
Found 5 hits for monomerid = 50079344
TargetAdenosine receptor A2a(Homo sapiens (Human))
Universit£
Curated by ChEMBL
LigandPNGBDBM50079344(CHEMBL3416775)
Affinity DataKi:  55nM. Assay description: Displacement of [3H]CGS21680 from human adenosine A2A receptor expressed in CHO cell membranes incubated for 120 mins by scintillation counting metho...
In DepthDetails ArticlePubMed
TargetAdenosine receptor A3(Homo sapiens (Human))
Universit£
Curated by ChEMBL
LigandPNGBDBM50079344(CHEMBL3416775)
Affinity DataKi:  2.16E+3nM. Assay description: Displacement of [3H]AB-MECA from human adenosine A3 receptor expressed in CHO cell membranes incubated for 30 mins by scintillation counting method
In DepthDetails ArticlePubMed
TargetAdenosine receptor A1(Homo sapiens (Human))
Universit£
Curated by ChEMBL
LigandPNGBDBM50079344(CHEMBL3416775)
Affinity DataKi: >1.00E+4nM. Assay description: Displacement of [3H]CCPA from human adenosine A1 receptor expressed in CHO cell membranes incubated for 120 mins by scintillation counting method
In DepthDetails ArticlePubMed
TargetAdenosine receptor A2b(Homo sapiens (Human))
Universit£
Curated by ChEMBL
LigandPNGBDBM50079344(CHEMBL3416775)
Affinity DataEC50: >1.00E+4nM. Assay description: Agonist activity at human adenosine A2B receptor expressed in CHO cells assessed as stimulation of [3H]cAMP levels by scintillation counting method
In DepthDetails ArticlePubMed
TargetAdenosine receptor A2a(Homo sapiens (Human))
Universit£
Curated by ChEMBL
LigandPNGBDBM50079344(CHEMBL3416775)
Affinity DataEC50:  91nM. Assay description: Agonist activity at human adenosine A2A receptor expressed in CHO cells assessed as stimulation of [3H]cAMP levels by scintillation counting method
In DepthDetails ArticlePubMed