BDBM50079508 CHEMBL3417300
SMILES Cc1c(C)c(=O)oc2cc(OCCN3CCN(CCCNc4c5CCCCc5nc5ccccc45)CC3)ccc12
InChI Key InChIKey=QXXGDBDNPIPTRF-UHFFFAOYSA-N
Data  1 KI  6 IC50
  Tab Delimited (TSV)   2D SDfile   Computed 3D by Vconf -m prep SDfile
Find this compound or compounds like it in BindingDB:
Activity Spreadsheet -- Enzyme Inhibition Constant Data from BindingDB
Found 7 hits for monomerid = 50079508
TargetAcetylcholinesterase(Electrophorus electricus (Electric eel))
China Pharmaceutical University
Curated by ChEMBL
LigandPNGBDBM50079508(CHEMBL3417300)
Affinity DataKi:  34nM. Assay description: Mixed-type inhibition of electric eel AChE by Lineweaver-Burk plot analysis
In DepthDetails ArticlePubMed
TargetAcetylcholinesterase(Electrophorus electricus (Electric eel))
China Pharmaceutical University
Curated by ChEMBL
LigandPNGBDBM50079508(CHEMBL3417300)
Affinity DataIC50:  34nM. Assay description: Inhibition of electric eel AChE using acetylthiocholine iodide as substrate incubated for 6 mins prior to substrate addition measured after 60 to 180...
In DepthDetails ArticlePubMed
TargetAmine oxidase [flavin-containing] A(Homo sapiens (Human))
China Pharmaceutical University
Curated by ChEMBL
LigandPNGBDBM50079508(CHEMBL3417300)
Affinity DataIC50:  1.51E+4nM. Assay description: Inhibition of human MAO-A using p-tyramine as substrate assessed as H2O2 production by amplex red assay
In DepthDetails ArticlePubMed
TargetAcetylcholinesterase(Homo sapiens (Human))
China Pharmaceutical University
Curated by ChEMBL
LigandPNGBDBM50079508(CHEMBL3417300)
Affinity DataIC50:  16nM. Assay description: Inhibition of human AChE using acetylthiocholine iodide as substrate incubated for 6 mins prior to substrate addition measured after 60 to 180 secs b...
In DepthDetails ArticlePubMed
TargetCholinesterase(Homo sapiens (Human))
China Pharmaceutical University
Curated by ChEMBL
LigandPNGBDBM50079508(CHEMBL3417300)
Affinity DataIC50:  113nM. Assay description: Inhibition of human BuChE using S-butyrylthiocholine iodide as substrate incubated for 6 mins prior to substrate addition measured after 60 to 180 se...
In DepthDetails ArticlePubMed
TargetCholinesterase(Equus caballus (Horse))
China Pharmaceutical University
Curated by ChEMBL
LigandPNGBDBM50079508(CHEMBL3417300)
Affinity DataIC50:  81nM. Assay description: Inhibition of horse serum BuChE using S-butyrylthiocholine iodide as substrate incubated for 6 mins prior to substrate addition measured after 60 to ...
In DepthDetails ArticlePubMed
TargetAmine oxidase [flavin-containing] B(Homo sapiens (Human))
China Pharmaceutical University
Curated by ChEMBL
LigandPNGBDBM50079508(CHEMBL3417300)
Affinity DataIC50:  240nM. Assay description: Inhibition of human MAO-B using p-tyramine as substrate assessed as H2O2 production by amplex red assay
In DepthDetails ArticlePubMed