BDBM50079590 (S)-3-(Pyrazin-2-yloxy)-1-aza-bicyclo[2.2.1]heptane::CHEMBL292574
SMILES C1CN2CC1[C@@H](C2)Oc1cnccn1
InChI Key InChIKey=NGTMUEJIOWVWCR-YGPZHTELSA-N
Data  3 KI
  Tab Delimited (TSV)   2D SDfile   Computed 3D by Vconf -m prep SDfile
Find this compound or compounds like it in BindingDB:
Activity Spreadsheet -- Enzyme Inhibition Constant Data from BindingDB
Found 3 hits for monomerid = 50079590
TargetMuscarinic acetylcholine receptor M2(Homo sapiens (Human))
Wyeth-Ayerst Research
Curated by ChEMBL
LigandPNGBDBM50079590((S)-3-(Pyrazin-2-yloxy)-1-aza-bicyclo[2.2.1]heptan...)
Affinity DataKi:  40nM. Assay description: Binding affinity towards human muscarinic M2 receptor
In DepthDetails ArticlePubMed
TargetMuscarinic acetylcholine receptor M1(Homo sapiens (Human))
Wyeth-Ayerst Research
Curated by ChEMBL
LigandPNGBDBM50079590((S)-3-(Pyrazin-2-yloxy)-1-aza-bicyclo[2.2.1]heptan...)
Affinity DataKi:  5.60E+3nM. Assay description: Affinity towards human M1 receptor expressed in CHO cells using [3H]QNB as radioligand
In DepthDetails ArticlePubMed
TargetMuscarinic acetylcholine receptor M1(Homo sapiens (Human))
Wyeth-Ayerst Research
Curated by ChEMBL
LigandPNGBDBM50079590((S)-3-(Pyrazin-2-yloxy)-1-aza-bicyclo[2.2.1]heptan...)
Affinity DataKi:  5.60E+3nM. Assay description: Affinity towards human M1 receptor expressed in CHO cells using [3H]QNB as radioligand
In DepthDetails ArticlePubMed