BDBM50079603 4-Bromo-N-(4-methyl-pyrimidin-2-yl)-benzenesulfonamide::CHEMBL300343
SMILES Cc1ccnc(NS(=O)(=O)c2ccc(Br)cc2)n1
InChI Key InChIKey=BXPWTHAOSBQAKK-UHFFFAOYSA-N
Data  1 IC50
  Tab Delimited (TSV)   2D SDfile   Computed 3D by Vconf -m prep SDfile
Find this compound or compounds like it in BindingDB:
Activity Spreadsheet -- Enzyme Inhibition Constant Data from BindingDB
Found 1 hit for monomerid = 50079603
TargetAcetolactate synthase, chloroplastic(Arabidopsis thaliana)
Nankai University
Curated by ChEMBL
LigandPNGBDBM50079603(4-Bromo-N-(4-methyl-pyrimidin-2-yl)-benzenesulfona...)
Affinity DataIC50:  5.90E+4nM. Assay description: Inhibitory activity against Acetolactate synthase (ALS) enzyme by using the rape-root growth method
In DepthDetails ArticlePubMed