BDBM50079708 3-(Benzo[b]thiophen-2-ylsulfanyl)-4-hydroxy-6-phenethyl-6-phenyl-5,6-dihydro-pyran-2-one::CHEMBL62158
SMILES O=C1CC(CCc2ccccc2)(OC(=O)C1Sc1cc2ccccc2s1)c1ccccc1
InChI Key InChIKey=TXSJLLXFVMAZEV-UHFFFAOYSA-N
Data  1 IC50
  Tab Delimited (TSV)   2D SDfile   Computed 3D by Vconf -m prep SDfile
Find this compound or compounds like it in BindingDB:
Activity Spreadsheet -- Enzyme Inhibition Constant Data from BindingDB
Found 1 hit for monomerid = 50079708
TargetGag-Pol polyprotein [489-587](Human immunodeficiency virus type 1)
Warner-Lambert
Curated by ChEMBL
LigandPNGBDBM50079708(3-(Benzo[b]thiophen-2-ylsulfanyl)-4-hydroxy-6-phen...)
Affinity DataIC50:  363nMpH: 4.7Assay Description:Inhibitory concentration against human immunodeficiency virus type 1(HIV-1) protease at pH 4.7
In DepthDetails ArticlePubMed