BDBM50079868 (rac)15-phenyl-10-azatetracyclo[11.3.1.02,11.04,9]heptadeca-2(11),3,5,7,9,14-hexaen-3-amine::CHEMBL109431
SMILES Nc1c2C3CC(Cc2nc2ccccc12)C=C(C3)c1ccccc1
InChI Key InChIKey=BJVZCRJSOVHVNN-UHFFFAOYSA-N
Data  1 IC50
  Tab Delimited (TSV)   2D SDfile   Computed 3D by Vconf -m prep SDfile
Find this compound or compounds like it in BindingDB:
Activity Spreadsheet -- Enzyme Inhibition Constant Data from BindingDB
Found 1 hit for monomerid = 50079868
TargetAcetylcholinesterase(Bos taurus (bovine))
Universitat De Barcelona
Curated by ChEMBL
LigandPNGBDBM50079868((rac)15-phenyl-10-azatetracyclo[11.3.1.02,11.04,9]...)
Affinity DataIC50:  126nM. Assay description: Inhibition of acetylcholinesterase (AChE)activity in bovine erythrocytes
In DepthDetails ArticlePubMed