BDBM50079873 (rac)15-butyl-10-azatetracyclo[11.3.1.02,11.04,9]heptadeca-2(11),3,5,7,9,14-hexaen-3-amine::CHEMBL111255
SMILES CCCCC1=CC2CC(C1)c1c(C2)nc2ccccc2c1N
InChI Key InChIKey=OYAZICUJFWDDIM-UHFFFAOYSA-N
Data  1 IC50
  Tab Delimited (TSV)   2D SDfile   Computed 3D by Vconf -m prep SDfile
Find this compound or compounds like it in BindingDB:
Activity Spreadsheet -- Enzyme Inhibition Constant Data from BindingDB
Found 1 hit for monomerid = 50079873
TargetAcetylcholinesterase(Bos taurus (bovine))
Universitat De Barcelona
Curated by ChEMBL
LigandPNGBDBM50079873((rac)15-butyl-10-azatetracyclo[11.3.1.02,11.04,9]h...)
Affinity DataIC50:  280nM. Assay description: Inhibition of acetylcholinesterase (AChE)activity in bovine erythrocytes
In DepthDetails ArticlePubMed