BDBM50080119 CHEMBL412817::Cyclo peptide analogue
SMILES CSCC[C@H]1NC(=O)CNC(=O)[C@H](NC(=O)[C@@H](CC(N)=O)NC(=O)[C@@H](CCC(O)=O)NC(=O)[C@@H](Cc2ccc(O)cc2)NC(=O)[C@@H](CC(C)C)NC(=O)[C@@H](CCCC(O)=O)NC(=O)CSC[C@@H](NC(=O)[C@@H](Cc2ccc(O)cc2)NC1=O)C(N)=O)C(C)C
InChI Key InChIKey=KVUJLUPYNZQNSN-YNLZADKXSA-N
Data  1 IC50
  Tab Delimited (TSV)   2D SDfile   Computed 3D by Vconf -m prep SDfile
Find this compound or compounds like it in BindingDB:
Activity Spreadsheet -- Enzyme Inhibition Constant Data from BindingDB
Found 1 hit for monomerid = 50080119
TargetGrowth factor receptor-bound protein 2(Homo sapiens (Human))
National Cancer Institute-Bethesda
Curated by ChEMBL
LigandPNGBDBM50080119(CHEMBL412817 | Cyclo peptide analogue)
Affinity DataIC50:  3.45E+3nM. Assay description: Inhibitory activity of the compound against Growth factor receptor bound protein 2
In DepthDetails ArticlePubMed