BDBM50080182 CHEMBL75868::Phosphoric acid mono-(4-{(S)-2-acetylamino-2-[(S)-3-carbamoyl-1-(3-cyclohexylmethyl-[1,2,4]oxadiazol-5-yl)-propylcarbamoyl]-ethyl}-phenyl) ester
SMILES CC(=O)N[C@@H](Cc1ccc(OP(O)(O)=O)cc1)C(=O)N[C@@H](CCC(N)=O)c1nc(CC2CCCCC2)no1
InChI Key InChIKey=MHLQUUUHCROQLQ-PMACEKPBSA-N
Data  1 IC50
  Tab Delimited (TSV)   2D SDfile   Computed 3D by Vconf -m prep SDfile
Find this compound or compounds like it in BindingDB:
Activity Spreadsheet -- Enzyme Inhibition Constant Data from BindingDB
Found 1 hit for monomerid = 50080182
TargetProto-oncogene tyrosine-protein kinase Src(Homo sapiens (Human))
Ariad Pharmaceuticals
Curated by ChEMBL
LigandPNGBDBM50080182(CHEMBL75868 | Phosphoric acid mono-(4-{(S)-2-acety...)
Affinity DataIC50:  2.78E+6nM. Assay description: Binding affinity against Src-homology 2 (SRC SH2).
In DepthDetails ArticlePubMed