BDBM50080585 (2R,3R,4S)-4-Benzo[1,3]dioxol-5-yl-1-[(2-ethyl-6-propyl-phenylcarbamoyl)-methyl]-2-(4-methoxy-phenyl)-pyrrolidine-3-carboxylic acid::CHEMBL123997
SMILES CCCc1cccc(CC)c1NC(=O)CN1C[C@@H]([C@H]([C@@H]1c1ccc(OC)cc1)C(O)=O)c1ccc2OCOc2c1
InChI Key InChIKey=APXDEEHRWJDGMC-ICTSCBFQSA-N
Data  2 IC50
  Tab Delimited (TSV)   2D SDfile   Computed 3D by Vconf -m prep SDfile
Find this compound or compounds like it in BindingDB:
Activity Spreadsheet -- Enzyme Inhibition Constant Data from BindingDB
Found 2 hits for monomerid = 50080585
TargetEndothelin-1 receptor(Homo sapiens (Human))
Abbott Laboratories
Curated by ChEMBL
LigandPNGBDBM50080585((2R,3R,4S)-4-Benzo[1,3]dioxol-5-yl-1-[(2-ethyl-6-p...)
Affinity DataIC50:  15nM. Assay description: Binding affinity towards human Endothelin A receptor (hET -A)
In DepthDetails ArticlePubMed
TargetEndothelin receptor type B(Homo sapiens (Human))
Abbott Laboratories
Curated by ChEMBL
LigandPNGBDBM50080585((2R,3R,4S)-4-Benzo[1,3]dioxol-5-yl-1-[(2-ethyl-6-p...)
Affinity DataIC50:  82nM. Assay description: Binding affinity towards human Endothelin B receptor (hET -B)
In DepthDetails ArticlePubMed