BDBM50080653 2-Amino-N-{[2-(4-sulfamoyl-phenyl)-ethylcarbamoyl]-methyl}-acetamide::CHEMBL122838
SMILES NCC(=O)NCC(=O)NCCc1ccc(cc1)S(N)(=O)=O
InChI Key InChIKey=LQFFPNBPFAGMFH-UHFFFAOYSA-N
Data  3 KI
  Tab Delimited (TSV)   2D SDfile   Computed 3D by Vconf -m prep SDfile
Find this compound or compounds like it in BindingDB:
Activity Spreadsheet -- Enzyme Inhibition Constant Data from BindingDB
Found 3 hits for monomerid = 50080653
TargetCarbonic anhydrase 2(Homo sapiens (Human))
Universit£
Curated by ChEMBL
LigandPNGBDBM50080653(2-Amino-N-{[2-(4-sulfamoyl-phenyl)-ethylcarbamoyl]...)
Affinity DataKi:  35nM. Assay description: Inhibitory activity against human recombinant carbonic anhydrase II (CA2)
In DepthDetails ArticlePubMed
TargetCarbonic anhydrase 4(Bos taurus (bovine))
Universit£
Curated by ChEMBL
LigandPNGBDBM50080653(2-Amino-N-{[2-(4-sulfamoyl-phenyl)-ethylcarbamoyl]...)
Affinity DataKi:  70nM. Assay description: Inhibitory activity against bovine carbonic anhydrase IV (CA4), isolated from bovine lung microsomes
In DepthDetails ArticlePubMed
TargetCarbonic anhydrase 1(Homo sapiens (Human))
Universit£
Curated by ChEMBL
LigandPNGBDBM50080653(2-Amino-N-{[2-(4-sulfamoyl-phenyl)-ethylcarbamoyl]...)
Affinity DataKi:  800nM. Assay description: Inhibitory activity against human recombinant carbonic anhydrase I (CA1)
In DepthDetails ArticlePubMed