BDBM50080833 CHEMBL264635::[1-[1-(1,2-Dicarbamoyl-ethylcarbamoyl)-2-(4-hydroxy-phenyl)-ethylcarbamoyl]-2-(4-phosphonooxy-phenyl)-ethyl]-carbamic acid 3-amino-benzyl ester
SMILES NC(=O)CC(NC(=O)C(Cc1ccc(O)cc1)NC(=O)C(Cc1ccc(OP(O)(O)=O)cc1)NC(=O)OCc1cccc(N)c1)C(N)=O
InChI Key InChIKey=XFCUYYUFEKZYMF-UHFFFAOYSA-N
Data  1 IC50  1 Kd
  Tab Delimited (TSV)   2D SDfile   Computed 3D by Vconf -m prep SDfile
Find this compound or compounds like it in BindingDB:
Activity Spreadsheet -- Enzyme Inhibition Constant Data from BindingDB
Found 2 hits for monomerid = 50080833
TargetGrowth factor receptor-bound protein 2(Homo sapiens (Human))
University Of Paris
Curated by ChEMBL
LigandPNGBDBM50080833(CHEMBL264635 | [1-[1-(1,2-Dicarbamoyl-ethylcarbamo...)
Affinity DataKd:  155nM. Assay description: The copound was tested on a LS250B Perkin-Elmer fluorimeter for Growth factor receptor bound protein 2 equilibrium constant(Kd) by the Michaelis-Ment...
In DepthDetails ArticlePubMed
TargetGrowth factor receptor-bound protein 2(Homo sapiens (Human))
University Of Paris
Curated by ChEMBL
LigandPNGBDBM50080833(CHEMBL264635 | [1-[1-(1,2-Dicarbamoyl-ethylcarbamo...)
Affinity DataIC50:  497nM. Assay description: The compound was evaluated for its potency to inhibit the interaction between Growth factor receptor bound protein 2 and phosphotyrosine-containing p...
In DepthDetails ArticlePubMed