BDBM50080915 2-((R)-2-Benzyl-4-butyl-3,6-dioxo-piperazin-1-yl)-N-[(S)-1-(1-carbamimidoyl-piperidin-3-ylmethyl)-2-oxo-2-thiazol-2-yl-ethyl]-acetamide::CHEMBL309298
SMILES CCCCN1CC(=O)N(CC(=O)N[C@@H](CC2CCCN(C2)C(N)=N)C(=O)c2nccs2)[C@H](Cc2ccccc2)C1=O
InChI Key InChIKey=YCOAEUYHPZQNMJ-ATTQYFOMSA-N
Data  1 KI  2 IC50
  Tab Delimited (TSV)   2D SDfile   Computed 3D by Vconf -m prep SDfile
Find this compound or compounds like it in BindingDB:
Activity Spreadsheet -- Enzyme Inhibition Constant Data from BindingDB
Found 3 hits for monomerid = 50080915
TargetProthrombin(Homo sapiens (Human))
Warner-Lambert
Curated by ChEMBL
LigandPNGBDBM50080915(2-((R)-2-Benzyl-4-butyl-3,6-dioxo-piperazin-1-yl)-...)
Affinity DataKi:  32nM. Assay description: Inhibition of thrombin
In DepthDetails ArticlePubMed
TargetSerine protease 1(Homo sapiens (Human))
Warner-Lambert
Curated by ChEMBL
LigandPNGBDBM50080915(2-((R)-2-Benzyl-4-butyl-3,6-dioxo-piperazin-1-yl)-...)
Affinity DataIC50:  1.50E+4nM. Assay description: Inhibitory concentration of the compound required against trypsin was determined
In DepthDetails ArticlePubMed
TargetProthrombin(Homo sapiens (Human))
Warner-Lambert
Curated by ChEMBL
LigandPNGBDBM50080915(2-((R)-2-Benzyl-4-butyl-3,6-dioxo-piperazin-1-yl)-...)
Affinity DataIC50:  340nM. Assay description: Inhibitory concentration of the compound required against thrombin was determined
In DepthDetails ArticlePubMed