BDBM50080930 2-[(R)-2-Benzyl-3,6-dioxo-4-(3-phenyl-propyl)-piperazin-1-yl]-N-[(S)-1-(1-carbamimidoyl-piperidin-3-ylmethyl)-2-oxo-2-thiazol-2-yl-ethyl]-acetamide::CHEMBL404654
SMILES [H][C@@]1(C[C@H](NC(=O)CN2[C@H](Cc3ccccc3)C(=O)N(CCCc3ccccc3)CC2=O)C(=O)c2nccs2)CCCN(C1)C(N)=N
InChI Key InChIKey=VLENRKZVWUVYFG-GUQXXGRISA-N
Data  1 KI  2 IC50
  Tab Delimited (TSV)   2D SDfile   Computed 3D by Vconf -m prep SDfile
Find this compound or compounds like it in BindingDB:
Activity Spreadsheet -- Enzyme Inhibition Constant Data from BindingDB
Found 3 hits for monomerid = 50080930
TargetProthrombin(Homo sapiens (Human))
Warner-Lambert
Curated by ChEMBL
LigandPNGBDBM50080930(2-[(R)-2-Benzyl-3,6-dioxo-4-(3-phenyl-propyl)-pipe...)
Affinity DataKi:  55nM. Assay description: Inhibition of thrombin
In DepthDetails ArticlePubMed
TargetSerine protease 1(Homo sapiens (Human))
Warner-Lambert
Curated by ChEMBL
LigandPNGBDBM50080930(2-[(R)-2-Benzyl-3,6-dioxo-4-(3-phenyl-propyl)-pipe...)
Affinity DataIC50:  9.10E+3nM. Assay description: Inhibitory concentration of the compound required against trypsin was determined
In DepthDetails ArticlePubMed
TargetProthrombin(Homo sapiens (Human))
Warner-Lambert
Curated by ChEMBL
LigandPNGBDBM50080930(2-[(R)-2-Benzyl-3,6-dioxo-4-(3-phenyl-propyl)-pipe...)
Affinity DataIC50:  170nM. Assay description: Inhibitory concentration of the compound required against thrombin was determined
In DepthDetails ArticlePubMed