BDBM50080941 (R)-2-[4-(3-Fluoro-benzylamino)-benzylamino]-propionamide::CHEMBL315738
SMILES C[C@@H](NCc1ccc(NCc2cccc(F)c2)cc1)C(N)=O
InChI Key InChIKey=HODIPNPBBMWJEC-GFCCVEGCSA-N
Data  3 IC50
  Tab Delimited (TSV)   2D SDfile   Computed 3D by Vconf -m prep SDfile
Find this compound or compounds like it in BindingDB:
Activity Spreadsheet -- Enzyme Inhibition Constant Data from BindingDB
Found 3 hits for monomerid = 50080941
TargetSodium channel protein type 1/2/3 subunit alpha(Rattus norvegicus)
Pharmacia & Upjohn
Curated by ChEMBL
LigandPNGBDBM50080941((R)-2-[4-(3-Fluoro-benzylamino)-benzylamino]-propi...)
Affinity DataIC50: >3.00E+5nM. Assay description: Inhibition of [3H]saxitoxin binding to rat brain sodium channel
In DepthDetails ArticlePubMed
TargetSodium channel protein type 1/2/3 subunit alpha(Rattus norvegicus)
Pharmacia & Upjohn
Curated by ChEMBL
LigandPNGBDBM50080941((R)-2-[4-(3-Fluoro-benzylamino)-benzylamino]-propi...)
Affinity DataIC50:  1.13E+4nM. Assay description: Inhibition of [3H]batrachotoxin binding to rat brain sodium channel
In DepthDetails ArticlePubMed
TargetSigma non-opioid intracellular receptor 1(RAT)
Pharmacia & Upjohn
Curated by ChEMBL
LigandPNGBDBM50080941((R)-2-[4-(3-Fluoro-benzylamino)-benzylamino]-propi...)
Affinity DataIC50:  280nM. Assay description: Inhibition of [3H]pentazocine binding to Opioid receptor sigma 1
In DepthDetails ArticlePubMed