BDBM50081506 3-[(S)-3-(7-Chloro-thieno[2,3-c]pyridine-2-sulfonylamino)-2-oxo-pyrrolidin-1-ylmethyl]-4-hydroxy-benzamidine::CHEMBL93151
SMILES NC(=N)c1ccc(O)c(CN2CC[C@H](NS(=O)(=O)c3cc4ccnc(Cl)c4s3)C2=O)c1
InChI Key InChIKey=QWKBVYMYRJYVKE-ZDUSSCGKSA-N
Data  6 KI
  Tab Delimited (TSV)   2D SDfile   Computed 3D by Vconf -m prep SDfile
Find this compound or compounds like it in BindingDB:
Activity Spreadsheet -- Enzyme Inhibition Constant Data from BindingDB
Found 6 hits for monomerid = 50081506
TargetCoagulation factor X(Homo sapiens (Human))
RhôNe-Poulenc Rorer
Curated by ChEMBL
LigandPNGBDBM50081506(3-[(S)-3-(7-Chloro-thieno[2,3-c]pyridine-2-sulfony...)
Affinity DataKi:  5nM. Assay description: Binding affinity against serine protease factor Xa (fXa)
In DepthDetails ArticlePubMed
TargetProthrombin(Homo sapiens (Human))
RhôNe-Poulenc Rorer
Curated by ChEMBL
LigandPNGBDBM50081506(3-[(S)-3-(7-Chloro-thieno[2,3-c]pyridine-2-sulfony...)
Affinity DataKi:  2.60E+3nM. Assay description: Binding affinity against thrombin
In DepthDetails ArticlePubMed
TargetSerine protease 1(Homo sapiens (Human))
RhôNe-Poulenc Rorer
Curated by ChEMBL
LigandPNGBDBM50081506(3-[(S)-3-(7-Chloro-thieno[2,3-c]pyridine-2-sulfony...)
Affinity DataKi: >2.90E+3nM. Assay description: Binding affinity against trypsin
In DepthDetails ArticlePubMed
TargetVitamin K-dependent protein C(Homo sapiens (Human))
RhôNe-Poulenc Rorer
Curated by ChEMBL
LigandPNGBDBM50081506(3-[(S)-3-(7-Chloro-thieno[2,3-c]pyridine-2-sulfony...)
Affinity DataKi:  5.50E+3nM. Assay description: Binding affinity against activated protein C (APC)
In DepthDetails ArticlePubMed
TargetPlasminogen(Homo sapiens (Human))
RhôNe-Poulenc Rorer
Curated by ChEMBL
LigandPNGBDBM50081506(3-[(S)-3-(7-Chloro-thieno[2,3-c]pyridine-2-sulfony...)
Affinity DataKi:  7.30E+3nM. Assay description: Binding affinity against plasmin
In DepthDetails ArticlePubMed
TargetTissue-type plasminogen activator(Homo sapiens (Human))
RhôNe-Poulenc Rorer
Curated by ChEMBL
LigandPNGBDBM50081506(3-[(S)-3-(7-Chloro-thieno[2,3-c]pyridine-2-sulfony...)
Affinity DataKi:  7.50E+3nM. Assay description: Binding affinity against tissue plasminogen activator (t-Pa)
In DepthDetails ArticlePubMed