BDBM50081934 CHEMBL3422354
SMILES Cl.COc1ccc(OC)c2c3oc(-c4cccc(F)c4)c(OCCOC(=O)CN)c(=O)c3cc(OC)c12
InChI Key InChIKey=GIKGPVHTMMMBLO-UHFFFAOYSA-N
Data  3 IC50
  Tab Delimited (TSV)   2D SDfile   Computed 3D by Vconf -m prep SDfile
Find this compound or compounds like it in BindingDB:
Activity Spreadsheet -- Enzyme Inhibition Constant Data from BindingDB
Found 3 hits for monomerid = 50081934
TargetCytochrome P450 1A2(Homo sapiens (Human))
Shanghai Jiao Tong University
Curated by ChEMBL
LigandPNGBDBM50081934(CHEMBL3422354)
Affinity DataIC50:  56nM. Assay description: Inhibition of human CYP1A2 assessed as reduction in 7-ethoxyresorufin O-deethylation activity by fluorescence based EROD assay
In DepthDetails ArticlePubMed
TargetCytochrome P450 1A1(Homo sapiens (Human))
Shanghai Jiao Tong University
Curated by ChEMBL
LigandPNGBDBM50081934(CHEMBL3422354)
Affinity DataIC50:  14nM. Assay description: Inhibition of human CYP1A1 assessed as reduction in 7-ethoxyresorufin O-deethylation activity by fluorescence based EROD assay
In DepthDetails ArticlePubMed
TargetCytochrome P450 1B1(Homo sapiens (Human))
Shanghai Jiao Tong University
Curated by ChEMBL
LigandPNGBDBM50081934(CHEMBL3422354)
Affinity DataIC50:  20nM. Assay description: Inhibition of human CYP1B1 assessed as reduction in 7-ethoxyresorufin O-deethylation activity by fluorescence based EROD assay
In DepthDetails ArticlePubMed