BDBM50082002 CHEMBL336699::[4-(9-Fluoro-pyrrolo[1,2-a]quinoxalin-4-yl)-piperazin-1-yl]-acetonitrile
SMILES Fc1cccc2nc(N3CCN(CC#N)CC3)c3cccn3c12
InChI Key InChIKey=HDCVWZBKLNSXBH-UHFFFAOYSA-N
Data  1 IC50
  Tab Delimited (TSV)   2D SDfile   Computed 3D by Vconf -m prep SDfile
Find this compound or compounds like it in BindingDB:
Activity Spreadsheet -- Enzyme Inhibition Constant Data from BindingDB
Found 1 hit for monomerid = 50082002
Target5-hydroxytryptamine receptor 3A/3B(Rattus norvegicus)
Universita' Degli Studi Di Salerno
Curated by ChEMBL
LigandPNGBDBM50082002(CHEMBL336699 | [4-(9-Fluoro-pyrrolo[1,2-a]quinoxal...)
Affinity DataIC50:  3.80E+3nM. Assay description: Binding affinity against 5-hydroxytryptamine 3 (5-HT3) receptor from rat cortical homogenate using [3H]-zacopride as radioligand
In DepthDetails ArticlePubMed