BDBM50082335 11-((S)-2-Octahydro-quinolizin-1-yl-thioacetyl)-5,11-dihydro-benzo[e]pyrido[3,2-b][1,4]diazepin-6-one::CHEMBL103189
SMILES O=C1Nc2cccnc2N(C(=S)CC2CCCN3CCCC[C@@H]23)c2ccccc12
InChI Key InChIKey=AGKOAFGRVCVBFH-CVMIBEPCSA-N
Data  3 IC50
  Tab Delimited (TSV)   2D SDfile   Computed 3D by Vconf -m prep SDfile
Find this compound or compounds like it in BindingDB:
Activity Spreadsheet -- Enzyme Inhibition Constant Data from BindingDB
Found 3 hits for monomerid = 50082335
TargetMuscarinic acetylcholine receptor M1(RAT)
Dipartimento Di Scienze Farmaceutiche - Università
Curated by ChEMBL
LigandPNGBDBM50082335(11-((S)-2-Octahydro-quinolizin-1-yl-thioacetyl)-5,...)
Affinity DataIC50:  10nM. Assay description: Displacement of [3H]-pirenzepine binding to muscarinic M1 receptor in brain cortex of rat.
In DepthDetails ArticlePubMed
TargetMuscarinic acetylcholine receptor M2(RAT)
Dipartimento Di Scienze Farmaceutiche - Università
Curated by ChEMBL
LigandPNGBDBM50082335(11-((S)-2-Octahydro-quinolizin-1-yl-thioacetyl)-5,...)
Affinity DataIC50:  760nM. Assay description: Displacement of [3H]-methylscopolamine binding to muscarinic M2 receptor in rat heart.
In DepthDetails ArticlePubMed
TargetMuscarinic acetylcholine receptor M3(RAT)
Dipartimento Di Scienze Farmaceutiche - Università
Curated by ChEMBL
LigandPNGBDBM50082335(11-((S)-2-Octahydro-quinolizin-1-yl-thioacetyl)-5,...)
Affinity DataIC50:  760nM. Assay description: Displacement of [3H]-methylscopolamine binding to muscarinic M3 receptor in submaxillary salivary glands of rats.
In DepthDetails ArticlePubMed