BDBM50082447 2-(2-Pyridin-4-yl-ethanesulfonyl)-1,2,3,4-tetrahydro-isoquinoline-3-carboxylic acid hydroxyamide::CHEMBL342710
SMILES ONC(=O)C1Cc2ccccc2CN1S(=O)(=O)CCc1ccncc1
InChI Key InChIKey=FJVADCMHIAHBER-UHFFFAOYSA-N
Data  2 IC50
  Tab Delimited (TSV)   2D SDfile   Computed 3D by Vconf -m prep SDfile
Find this compound or compounds like it in BindingDB:
Activity Spreadsheet -- Enzyme Inhibition Constant Data from BindingDB
Found 2 hits for monomerid = 50082447
TargetStromelysin-1(Homo sapiens (Human))
Hoechst Marion Roussel
Curated by ChEMBL
LigandPNGBDBM50082447(2-(2-Pyridin-4-yl-ethanesulfonyl)-1,2,3,4-tetrahyd...)
Affinity DataIC50:  900nM. Assay description: Inhibitory concentration of the compound against human matrix metalloproteinase-3 (MMP-3)
In DepthDetails ArticlePubMed
TargetNeutrophil collagenase(Homo sapiens (Human))
Hoechst Marion Roussel
Curated by ChEMBL
LigandPNGBDBM50082447(2-(2-Pyridin-4-yl-ethanesulfonyl)-1,2,3,4-tetrahyd...)
Affinity DataIC50:  30nM. Assay description: Inhibitory concentration against human matrix metalloproteinase-8 (human neutrophil collagenase, MMP-8)
In DepthDetails ArticlePubMed