BDBM50082505 CHEMBL343775::[2-(4-Bromo-benzenesulfonyl)-1,2,3,4-tetrahydro-isoquinolin-3-yl]-oxo-acetic acid
SMILES OC(=O)C(=O)C1Cc2ccccc2CN1S(=O)(=O)c1ccc(Br)cc1
InChI Key InChIKey=NYWZLYBVEDVMSN-UHFFFAOYSA-N
Data  2 IC50
  Tab Delimited (TSV)   2D SDfile   Computed 3D by Vconf -m prep SDfile
Find this compound or compounds like it in BindingDB:
Activity Spreadsheet -- Enzyme Inhibition Constant Data from BindingDB
Found 2 hits for monomerid = 50082505
TargetNeutrophil collagenase(Homo sapiens (Human))
Hoechst Marion Roussel
Curated by ChEMBL
LigandPNGBDBM50082505(CHEMBL343775 | [2-(4-Bromo-benzenesulfonyl)-1,2,3,...)
Affinity DataIC50:  600nM. Assay description: Inhibitory concentration against human matrix metalloproteinase-8 (human neutrophil collagenase, MMP-8)
In DepthDetails ArticlePubMed
TargetStromelysin-1(Homo sapiens (Human))
Hoechst Marion Roussel
Curated by ChEMBL
LigandPNGBDBM50082505(CHEMBL343775 | [2-(4-Bromo-benzenesulfonyl)-1,2,3,...)
Affinity DataIC50:  5.00E+3nM. Assay description: Inhibitory concentration of the compound against human matrix metalloproteinase-3 (MMP-3)
In DepthDetails ArticlePubMed