BDBM50082570 2-[2-butyl-1-(4-carboxybenzyl)-1H-5-imidazolylmethylamino]benzoic acid::CHEMBL342261
SMILES CCCCc1ncc(CNc2ccccc2C(O)=O)n1Cc1ccc(cc1)C(O)=O
InChI Key InChIKey=CYMNUSLALCTFLJ-UHFFFAOYSA-N
Data  1 KI
  Tab Delimited (TSV)   2D SDfile   Computed 3D by Vconf -m prep SDfile
Find this compound or compounds like it in BindingDB:
Activity Spreadsheet -- Enzyme Inhibition Constant Data from BindingDB
Found 1 hit for monomerid = 50082570
TargetType-1 angiotensin II receptor A(RAT)
Laboratoires Fournier
Curated by ChEMBL
LigandPNGBDBM50082570(2-[2-butyl-1-(4-carboxybenzyl)-1H-5-imidazolylmeth...)
Affinity DataKi:  12.1nM. Assay description: The compound was evaluated for the inhibition of [125I]-Sar-AII binding to Angiotensin II receptor, type 1 from purified rat liver membranes.
In DepthDetails ArticlePubMed