BDBM50082809 3-{3-[4,4-Bis-(4-chloro-phenyl)-piperidin-1-yl]-propylcarbamoyl}-4-(3,4-difluoro-phenyl)-6-methyl-2-oxo-1,2,3,4-tetrahydro-pyrimidine-5-carboxylic acid methyl ester::CHEMBL356571
SMILES COC(=O)C1=C(C)NC(=O)N(C1c1ccc(F)c(F)c1)C(=O)NCCCN1CCC(CC1)(c1ccc(Cl)cc1)c1ccc(Cl)cc1
InChI Key InChIKey=UZMKDOUDIGKWHV-UHFFFAOYSA-N
Data  3 KI
  Tab Delimited (TSV)   2D SDfile   Computed 3D by Vconf -m prep SDfile
Find this compound or compounds like it in BindingDB:
Activity Spreadsheet -- Enzyme Inhibition Constant Data from BindingDB
Found 3 hits for monomerid = 50082809
TargetAlpha-1A adrenergic receptor(Homo sapiens (Human))
Synaptic Pharmaceutical
Curated by ChEMBL
LigandPNGBDBM50082809(3-{3-[4,4-Bis-(4-chloro-phenyl)-piperidin-1-yl]-pr...)
Affinity DataKi:  6.90nM. Assay description: In vitro binding affinity against alpha-1A adrenergic receptor of human liver microsomes
In DepthDetails ArticlePubMed
TargetAlpha-1B adrenergic receptor(Homo sapiens (Human))
Synaptic Pharmaceutical
Curated by ChEMBL
LigandPNGBDBM50082809(3-{3-[4,4-Bis-(4-chloro-phenyl)-piperidin-1-yl]-pr...)
Affinity DataKi:  84nM. Assay description: In vitro binding affinity against Alpha-1B adrenergic receptor of human liver microsomes.
In DepthDetails ArticlePubMed
TargetAlpha-1D adrenergic receptor(Homo sapiens (Human))
Synaptic Pharmaceutical
Curated by ChEMBL
LigandPNGBDBM50082809(3-{3-[4,4-Bis-(4-chloro-phenyl)-piperidin-1-yl]-pr...)
Affinity DataKi:  560nM. Assay description: In vitro binding affinity against alpha-1D adrenergic receptor of human liver microsomes.
In DepthDetails ArticlePubMed