BDBM50082836 4,4-Bis-(3,5-dimethyl-phenyl)-piperidine::CHEMBL144894
SMILES Cc1cc(C)cc(c1)C1(CCNCC1)c1cc(C)cc(C)c1
InChI Key InChIKey=YPGIWJYVYKQSFG-UHFFFAOYSA-N
Data  1 IC50
  Tab Delimited (TSV)   2D SDfile   Computed 3D by Vconf -m prep SDfile
Find this compound or compounds like it in BindingDB:
Activity Spreadsheet -- Enzyme Inhibition Constant Data from BindingDB
Found 1 hit for monomerid = 50082836
TargetMu-type opioid receptor(Homo sapiens (Human))
Synaptic Pharmaceutical
Curated by ChEMBL
LigandPNGBDBM50082836(4,4-Bis-(3,5-dimethyl-phenyl)-piperidine | CHEMBL1...)
Affinity DataIC50:  2.70E+4nM. Assay description: Inhibitory concentration of the compound against Opioid receptor mu 1 using [3H]-DAMGO ligand
In DepthDetails ArticlePubMed