BDBM50082974 (2S,3S)-2-(3,5-Dichloro-phenylsulfanyl)-N*4*-((S)-2,2-dimethyl-1-methylcarbamoyl-propyl)-N*1*-hydroxy-3-isobutyl-succinamide::CHEMBL144736
SMILES CNC(=O)[C@@H](NC(=O)[C@H](CC(C)C)[C@H](Sc1cc(Cl)cc(Cl)c1)C(=O)NO)C(C)(C)C
InChI Key InChIKey=WTCZFDOCEWZMII-IXDOHACOSA-N
Data  2 IC50
  Tab Delimited (TSV)   2D SDfile   Computed 3D by Vconf -m prep SDfile
Find this compound or compounds like it in BindingDB:
Activity Spreadsheet -- Enzyme Inhibition Constant Data from BindingDB
Found 2 hits for monomerid = 50082974
TargetDisintegrin and metalloproteinase domain-containing protein 17(Homo sapiens (Human))
Astrazeneca
Curated by ChEMBL
LigandPNGBDBM50082974((2S,3S)-2-(3,5-Dichloro-phenylsulfanyl)-N*4*-((S)-...)
Affinity DataIC50:  0.420nM. Assay description: Inhibitory activity against Tumor necrosis factor alpha-converting enzyme (TACE) in blood.
In DepthDetails ArticlePubMed
TargetDisintegrin and metalloproteinase domain-containing protein 17(Homo sapiens (Human))
Astrazeneca
Curated by ChEMBL
LigandPNGBDBM50082974((2S,3S)-2-(3,5-Dichloro-phenylsulfanyl)-N*4*-((S)-...)
Affinity DataIC50:  4.90E+3nM. Assay description: Inhibition of TNF(tumor necrosis factor) in human blood
In DepthDetails ArticlePubMed