BDBM50083045 1-{3-[4-(2-Methoxy-phenyl)-piperazin-1-yl]-cyclohexyl}-1H-benzotriazole::CHEMBL147972
SMILES COc1ccccc1N1CCN(CC1)C1CCCC(C1)n1nnc2ccccc12
InChI Key InChIKey=ZBSYTKMCHQSBSC-UHFFFAOYSA-N
Data  1 KI
  Tab Delimited (TSV)   2D SDfile   Computed 3D by Vconf -m prep SDfile
Find this compound or compounds like it in BindingDB:
Activity Spreadsheet -- Enzyme Inhibition Constant Data from BindingDB
Found 1 hit for monomerid = 50083045
Target5-hydroxytryptamine receptor 1A(Rattus norvegicus (rat))
Polish Academy Of Sciences
Curated by ChEMBL
LigandPNGBDBM50083045(1-{3-[4-(2-Methoxy-phenyl)-piperazin-1-yl]-cyclohe...)
Affinity DataKi:  47nM. Assay description: Ability of the compound to displace [3H]-8-OH-DPAT from 5-hydroxytryptamine 1A receptor
In DepthDetails ArticlePubMed