BDBM50083155 (S)-2-[(S)-3-(4-Hydroxy-2,6-dimethyl-phenyl)-2-pyrrol-1-yl-propionyl]-1,2,3,4-tetrahydro-isoquinoline-3-carboxylic acid::CHEMBL149610
SMILES Cc1cc(O)cc(C)c1C[C@@H](C(=O)N1Cc2ccccc2C[C@H]1C(O)=O)n1cccc1
InChI Key InChIKey=TXZQLIIAZDRDKP-GOTSBHOMSA-N
Data  3 KI
  Tab Delimited (TSV)   2D SDfile   Computed 3D by Vconf -m prep SDfile
Find this compound or compounds like it in BindingDB:
Activity Spreadsheet -- Enzyme Inhibition Constant Data from BindingDB
Found 3 hits for monomerid = 50083155
TargetDelta-type opioid receptor(Rattus norvegicus (rat))
University Of Ferrara
Curated by ChEMBL
LigandPNGBDBM50083155((S)-2-[(S)-3-(4-Hydroxy-2,6-dimethyl-phenyl)-2-pyr...)
Affinity DataKi:  9.94nM. Assay description: Binding affinity at Opioid receptor delta 1 from rat brain synaptosomal preparations by H-Dmt-Tic-OH displacement.
In DepthDetails ArticlePubMed
TargetDelta-type opioid receptor(Rattus norvegicus (rat))
University Of Ferrara
Curated by ChEMBL
LigandPNGBDBM50083155((S)-2-[(S)-3-(4-Hydroxy-2,6-dimethyl-phenyl)-2-pyr...)
Affinity DataKi:  16.6nM. Assay description: Binding affinity at Opioid receptor delta 1 from rat brain synaptosomal preparations by [3H]N,N-(Me)2-Dmt-Tic-OH displacement.
In DepthDetails ArticlePubMed
TargetMu-type opioid receptor(Rattus norvegicus (rat))
University Of Ferrara
Curated by ChEMBL
LigandPNGBDBM50083155((S)-2-[(S)-3-(4-Hydroxy-2,6-dimethyl-phenyl)-2-pyr...)
Affinity DataKi:  5.59E+3nM. Assay description: Binding affinity at Opioid receptor mu 1 from rat brain synaptosomal preparations by [3H]-DAGO displacement.
In DepthDetails ArticlePubMed