BDBM50083164 (S)-2-[(S)-2-Amino-3-(4-hydroxy-2,6-dimethyl-phenyl)-propionyl]-1,2,3,4-tetrahydro-isoquinoline-3-carboxylic acid adamantan-1-ylamide::CHEMBL148291
SMILES Cc1cc(O)cc(C)c1C[C@H](N)C(=O)N1Cc2ccccc2C[C@H]1C(=O)NC12C[C@H]3C[C@H](C[C@H](C3)C1)C2
InChI Key InChIKey=VFBRUMHJLLKXHR-DYYFJMCXSA-N
Data  5 KI
  Tab Delimited (TSV)   2D SDfile   Computed 3D by Vconf -m prep SDfile
Find this compound or compounds like it in BindingDB:
Activity Spreadsheet -- Enzyme Inhibition Constant Data from BindingDB
Found 5 hits for monomerid = 50083164
TargetDelta-type opioid receptor(Rattus norvegicus (rat))
University Of Ferrara
Curated by ChEMBL
LigandPNGBDBM50083164((S)-2-[(S)-2-Amino-3-(4-hydroxy-2,6-dimethyl-pheny...)
Affinity DataKi:  0.260nM. Assay description: Binding affinity at Opioid receptor delta 1 from rat brain synaptosomal preparations by [3H]N,N-(Me)2-Dmt-Tic-OH displacement.
In DepthDetails ArticlePubMed
TargetMu-type opioid receptor(Rattus norvegicus (rat))
University Of Ferrara
Curated by ChEMBL
LigandPNGBDBM50083164((S)-2-[(S)-2-Amino-3-(4-hydroxy-2,6-dimethyl-pheny...)
Affinity DataKi:  0.760nM. Assay description: Binding affinity at Opioid receptor mu 1 from rat brain synaptosomal preparations by [3H]-DAGO displacement.
In DepthDetails ArticlePubMed
TargetDelta-type opioid receptor(Rattus norvegicus (rat))
University Of Ferrara
Curated by ChEMBL
LigandPNGBDBM50083164((S)-2-[(S)-2-Amino-3-(4-hydroxy-2,6-dimethyl-pheny...)
Affinity DataKi:  1.01nM. Assay description: Binding affinity at Opioid receptor delta 1 from rat brain synaptosomal preparations by H-Dmt-Tic-OH displacement.
In DepthDetails ArticlePubMed
TargetDelta-type opioid receptor(Homo sapiens (Human))
University Of Sydney
Curated by ChEMBL
LigandPNGBDBM50083164((S)-2-[(S)-2-Amino-3-(4-hydroxy-2,6-dimethyl-pheny...)
Affinity DataKi:  1.20nM. Assay description: Antagonist activity at DOR
In DepthDetails ArticlePubMed
TargetMu-type opioid receptor(Homo sapiens (Human))
University Of Sydney
Curated by ChEMBL
LigandPNGBDBM50083164((S)-2-[(S)-2-Amino-3-(4-hydroxy-2,6-dimethyl-pheny...)
Affinity DataKi:  86nM. Assay description: Antagonist activity at MOR
In DepthDetails ArticlePubMed