BDBM50083284 Adamantane-1-carboxylic acid [1-benzyl-2-(4-benzyl-piperazin-1-yl)-ethyl]-amide; Dihydrochloride::CHEMBL541345
SMILES O=C(N[C@@H](CN1CCN(Cc2ccccc2)CC1)Cc1ccccc1)C12C[C@H]3C[C@H](C[C@H](C3)C1)C2
InChI Key InChIKey=FPCGZBYCAHIMKC-MGDUNCDCSA-N
Data  2 KI
  Tab Delimited (TSV)   2D SDfile   Computed 3D by Vconf -m prep SDfile
Find this compound or compounds like it in BindingDB:
Activity Spreadsheet -- Enzyme Inhibition Constant Data from BindingDB
Found 2 hits for monomerid = 50083284
Target5-hydroxytryptamine receptor 1A(Rattus norvegicus (rat))
Wyeth-Ayerst Research
Curated by ChEMBL
LigandPNGBDBM50083284(Adamantane-1-carboxylic acid [1-benzyl-2-(4-benzyl...)
Affinity DataKi:  2.30nM. Assay description: Antagonist activity against rat hippocampal tissue 5-hydroxytryptamine 1A receptor
In DepthDetails ArticlePubMed
TargetD(2) dopamine receptor(Rattus norvegicus (rat))
Wyeth-Ayerst Research
Curated by ChEMBL
LigandPNGBDBM50083284(Adamantane-1-carboxylic acid [1-benzyl-2-(4-benzyl...)
Affinity DataKi:  1.40E+3nM. Assay description: Inhibitory activity against rat limbic tissue Dopamine receptor D2
In DepthDetails ArticlePubMed