BDBM50083343 6-[4-(4-Chloro-phenyl)-piperazin-1-ylmethyl]-4H-benzo[1,4]oxazin-3-one::CHEMBL147011
SMILES Clc1ccc(cc1)N1CCN(Cc2ccc3OCC(=O)Nc3c2)CC1
InChI Key InChIKey=XJCFFIUVQKFBHI-UHFFFAOYSA-N
Data  3 KI
  Tab Delimited (TSV)   2D SDfile   Computed 3D by Vconf -m prep SDfile
Find this compound or compounds like it in BindingDB:
Activity Spreadsheet -- Enzyme Inhibition Constant Data from BindingDB
Found 3 hits for monomerid = 50083343
TargetD(4) dopamine receptor(Homo sapiens (Human))
Warner-Lambert
Curated by ChEMBL
LigandPNGBDBM50083343(6-[4-(4-Chloro-phenyl)-piperazin-1-ylmethyl]-4H-be...)
Affinity DataKi:  62nM. Assay description: Binding affinity at Dopamine receptor D4 in CHO cells by radioligand displacement.
In DepthDetails ArticlePubMed
TargetD(3) dopamine receptor(Homo sapiens (Human))
Warner-Lambert
Curated by ChEMBL
LigandPNGBDBM50083343(6-[4-(4-Chloro-phenyl)-piperazin-1-ylmethyl]-4H-be...)
Affinity DataKi: >3.03E+3nM. Assay description: Binding affinity at Dopamine receptor D3 in CHO cells by radioligand displacement.
In DepthDetails ArticlePubMed
TargetD(2) dopamine receptor(Homo sapiens (Human))
Warner-Lambert
Curated by ChEMBL
LigandPNGBDBM50083343(6-[4-(4-Chloro-phenyl)-piperazin-1-ylmethyl]-4H-be...)
Affinity DataKi: >5.88E+3nM. Assay description: Binding affinity at Dopamine receptor D2 in CHO cells by radioligand displacement.
In DepthDetails ArticlePubMed